BDBM50135063 1-(2,6-Diamino-hexanoyl)-piperidine-2-carbonitrile::CHEMBL145813
SMILES NCCCCC(N)C(=O)N1CCCCC1C#N
InChI Key InChIKey=RVIRSPCRFRPYII-UHFFFAOYSA-N
Data  2 IC50
  Tab Delimited (TSV)   2D SDfile   Computed 3D by Vconf -m prep SDfile
Find this compound or compounds like it in BindingDB:
Activity Spreadsheet -- Enzyme Inhibition Constant Data from BindingDB
Found 2 hits for monomerid = 50135063
TargetDipeptidyl peptidase 2(Homo sapiens (Human))
University Of Antwerp (Uia)
Curated by ChEMBL
LigandPNGBDBM50135063(1-(2,6-Diamino-hexanoyl)-piperidine-2-carbonitrile...)
Affinity DataIC50:  1.50E+3nM. Assay description: Inhibitory activity of compound against Dipeptidylpeptidase II (DPP II)
In DepthDetails ArticlePubMed
TargetDipeptidyl peptidase 4(Homo sapiens (Human))
University Of Antwerp (Uia)
Curated by ChEMBL
LigandPNGBDBM50135063(1-(2,6-Diamino-hexanoyl)-piperidine-2-carbonitrile...)
Affinity DataIC50:  5.10E+4nM. Assay description: Inhibitory activity against Dipeptidylpeptidase IV (DPP IV)
In DepthDetails ArticlePubMed