BDBM50136157 4-(Phenoxy-phenyl-methyl)-piperidine::CHEMBL447188
SMILES C1CC(CCN1)C(Oc1ccccc1)c1ccccc1
InChI Key InChIKey=KXEKNLMZGWBPMX-UHFFFAOYSA-N
Data  1 KI  2 IC50
  Tab Delimited (TSV)   2D SDfile   Computed 3D by Vconf -m prep SDfile
Find this compound or compounds like it in BindingDB:
Activity Spreadsheet -- Enzyme Inhibition Constant Data from BindingDB
Found 2 hits for monomerid = 50136157
Target5-hydroxytryptamine receptor 1A(Rattus norvegicus (rat))
Faes Farma
Curated by ChEMBL
LigandPNGBDBM50136157(4-(Phenoxy-phenyl-methyl)-piperidine | CHEMBL44718...)
Affinity DataIC50: >1.00E+3nM. Assay description: Binding affinity against 5-hydroxytryptamine 1A receptor (5-HT1A) by displacement of [3H]8-OH-DPAT from rat hippocampus membranes
In DepthDetails ArticlePubMed
Target5-hydroxytryptamine receptor 2A(Rattus norvegicus (rat))
Faes Farma
Curated by ChEMBL
LigandPNGBDBM50136157(4-(Phenoxy-phenyl-methyl)-piperidine | CHEMBL44718...)
Affinity DataIC50: >1.00E+3nM. Assay description: Binding affinity against 5-hydroxytryptamine 2A receptor by displacement of [3H]-ketanserin from rat prefrontal cerebral cortex mambranes
In DepthDetails ArticlePubMed