BDBM50136453 CHEMBL3752624
SMILES CC(C)Nc1cc(cc(C)n1)-c1nnc(s1)-c1cc(F)c(OC[C@H]2CNC(=O)CO2)cc1Cl
InChI Key InChIKey=XSDXLXDCPHTPBR-CQSZACIVSA-N
Data  1 EC50
  Tab Delimited (TSV)   2D SDfile   Computed 3D by Vconf -m prep SDfile
Find this compound or compounds like it in BindingDB:
Activity Spreadsheet -- Enzyme Inhibition Constant Data from BindingDB
Found 1 hit for monomerid = 50136453
TargetSphingosine 1-phosphate receptor 1(Homo sapiens (Human))
Boehringer Ingelheim Pharmaceuticals
Curated by ChEMBL
LigandPNGBDBM50136453(CHEMBL3752624)
Affinity DataEC50:  550nM. Assay description: Agonist activity at human S1P1 receptor expressed in EDG1-bla U2OS cells incubated for 18 hrs prior to GenBlazer substrate addition by beta-arrestin ...
In DepthDetails ArticlePubMed