BDBM50137314 (R)-2-Cyclopentylmethyl-N-{(S)-1-[3-fluoro-4-(4-hydroxy-piperidin-1-yl)-benzoyl]-2,2-dimethyl-propyl}-3-(formyl-hydroxy-amino)-propionamide::CHEMBL160164
SMILES CC(C)(C)[C@H](NC(=O)[C@H](CC1CCCC1)CN(O)C=O)C(=O)c1ccc(N2CCC(O)CC2)c(F)c1
InChI Key InChIKey=IBOKHVLONITYHP-CJFMBICVSA-N
Data  1 IC50
  Tab Delimited (TSV)   2D SDfile   Computed 3D by Vconf -m prep SDfile
Find this compound or compounds like it in BindingDB:
Activity Spreadsheet -- Enzyme Inhibition Constant Data from BindingDB
Found 1 hit for monomerid = 50137314
TargetPeptide deformylase(Escherichia coli)
British Biotech Pharmaceuticals
Curated by ChEMBL
LigandPNGBDBM50137314((R)-2-Cyclopentylmethyl-N-{(S)-1-[3-fluoro-4-(4-hy...)
Affinity DataIC50:  2nM. Assay description: Inhibitory activity against Escherichia coli peptide deformylase (PDF) Nickel containing enzyme
In DepthDetails ArticlePubMed