BDBM50137334 (R)-2-Cyclopentylmethyl-N-((S)-2,2-dimethyl-1-{4-[4-(2-morpholin-4-yl-ethyl)-piperazin-1-yl]-benzoyl}-propyl)-3-(formyl-hydroxy-amino)-propionamide::CHEMBL346291
SMILES CC(C)(C)[C@H](NC(=O)[C@H](CC1CCCC1)CN(O)C=O)C(=O)c1ccc(cc1)N1CCN(CCN2CCOCC2)CC1
InChI Key InChIKey=GNKDAFHMMHAYTA-POURPWNDSA-N
Data  1 IC50
  Tab Delimited (TSV)   2D SDfile   Computed 3D by Vconf -m prep SDfile
Find this compound or compounds like it in BindingDB:
Activity Spreadsheet -- Enzyme Inhibition Constant Data from BindingDB
Found 1 hit for monomerid = 50137334
TargetPeptide deformylase(Escherichia coli)
British Biotech Pharmaceuticals
Curated by ChEMBL
LigandPNGBDBM50137334((R)-2-Cyclopentylmethyl-N-((S)-2,2-dimethyl-1-{4-[...)
Affinity DataIC50:  2nM. Assay description: Inhibitory activity against Escherichia coli peptide deformylase (PDF) Nickel containing enzyme
In DepthDetails ArticlePubMed