BDBM50137345 (R)-2-[(Formyl-hydroxy-amino)-methyl]-hexanoic acid [(S)-1-(4-methoxy-benzoyl)-2,2-dimethyl-propyl]-amide::CHEMBL156033
SMILES CCCC[C@H](CN(O)C=O)C(=O)N[C@H](C(=O)c1ccc(OC)cc1)C(C)(C)C
InChI Key InChIKey=JDATXQDDINQWAX-VQIMIIECSA-N
Data  1 IC50
  Tab Delimited (TSV)   2D SDfile   Computed 3D by Vconf -m prep SDfile
Find this compound or compounds like it in BindingDB:
Activity Spreadsheet -- Enzyme Inhibition Constant Data from BindingDB
Found 1 hit for monomerid = 50137345
TargetPeptide deformylase(Escherichia coli)
British Biotech Pharmaceuticals
Curated by ChEMBL
LigandPNGBDBM50137345((R)-2-[(Formyl-hydroxy-amino)-methyl]-hexanoic aci...)
Affinity DataIC50:  1nM. Assay description: Inhibitory activity against Escherichia coli peptide deformylase (PDF) Nickel containing enzyme
In DepthDetails ArticlePubMed