BDBM50137755 2-Chloro-N-(3-cyano-5,6-dihydro-4H-cyclopenta[b]thiophen-2-yl)-4-(3-hydroxy-propylamino)-5-(morpholine-4-sulfonyl)-benzamide::CHEMBL330337::MurF inhibitor, 11
SMILES OCCCNc1cc(Cl)c(cc1S(=O)(=O)N1CCOCC1)C(=O)Nc1sc2CCCc2c1C#N
InChI Key InChIKey=FOOAFKITLZNIPG-UHFFFAOYSA-N
Data  3 IC50
  Tab Delimited (TSV)   2D SDfile   Computed 3D by Vconf -m prep SDfile
Find this compound or compounds like it in BindingDB:
Activity Spreadsheet -- Enzyme Inhibition Constant Data from BindingDB
Found 3 hits for monomerid = 50137755
TargetUDP-N-acetylmuramoyl-tripeptide--D-alanyl-D-alanine ligase(Streptococcus pneumoniae (Firmicutes))
Abbott Laboratories
LigandPNGBDBM50137755(2-Chloro-N-(3-cyano-5,6-dihydro-4H-cyclopenta[b]th...)
Affinity DataIC50: >1.00E+5nM. Assay description: Inhibition of D-Ala-D-Ala adding enzyme (MurF) from Streptococcus pneumoniase.
In DepthDetails ArticlePubMed
TargetUDP-N-acetylmuramoyl-tripeptide--D-alanyl-D-alanine ligase(Streptococcus pneumoniae (Firmicutes))
Abbott Laboratories
LigandPNGBDBM50137755(2-Chloro-N-(3-cyano-5,6-dihydro-4H-cyclopenta[b]th...)
Affinity DataIC50: >1.00E+5nM. Assay description: Inhibition of Streptococcus pneumoniae MurF
In DepthDetails ArticlePubMed
TargetUDP-N-acetylmuramoyl-tripeptide--D-alanyl-D-alanine ligase(Streptococcus pneumoniae (Firmicutes))
Abbott Laboratories
LigandPNGBDBM50137755(2-Chloro-N-(3-cyano-5,6-dihydro-4H-cyclopenta[b]th...)
Affinity DataIC50: >1.00E+5nM. Assay description: Antibacterial activity against UDP-MurNAc-pentapeptide synthetase from Streptococcus pneumoniae.
In DepthDetails ArticlePubMed