BDBM50138335 5-Amino-1-(3,4-dichloro-benzyl)-1H-indole-2-carboxylic acid::CHEMBL130598
SMILES Nc1ccc2n(Cc3ccc(Cl)c(Cl)c3)c(cc2c1)C(O)=O
InChI Key InChIKey=PAIPLQRQUARRGZ-UHFFFAOYSA-N
Data  1 IC50
  Tab Delimited (TSV)   2D SDfile   Computed 3D by Vconf -m prep SDfile
Find this compound or compounds like it in BindingDB:
Activity Spreadsheet -- Enzyme Inhibition Constant Data from BindingDB
Found 1 hit for monomerid = 50138335
TargetC-C chemokine receptor type 2(Homo sapiens (Human))
Astrazeneca
Curated by ChEMBL
LigandPNGBDBM50138335(5-Amino-1-(3,4-dichloro-benzyl)-1H-indole-2-carbox...)
Affinity DataIC50:  500nM. Assay description: Inhibition of human C-C chemokine receptor type 2
In DepthDetails ArticlePubMed