BDBM50138379 CHEMBL130318::N-[1-(3,4-Dichloro-benzyl)-1H-indole-2-carbonyl]-benzenesulfonamide
SMILES Clc1ccc(Cn2c(cc3ccccc23)C(=O)NS(=O)(=O)c2ccccc2)cc1Cl
InChI Key InChIKey=YIGWFXXIGRKFDH-UHFFFAOYSA-N
Data  1 IC50
  Tab Delimited (TSV)   2D SDfile   Computed 3D by Vconf -m prep SDfile
Find this compound or compounds like it in BindingDB:
Activity Spreadsheet -- Enzyme Inhibition Constant Data from BindingDB
Found 1 hit for monomerid = 50138379
TargetC-C chemokine receptor type 2(Homo sapiens (Human))
Astrazeneca
Curated by ChEMBL
LigandPNGBDBM50138379(CHEMBL130318 | N-[1-(3,4-Dichloro-benzyl)-1H-indol...)
Affinity DataIC50:  4.78E+3nM. Assay description: Inhibition of human C-C chemokine receptor type 2
In DepthDetails ArticlePubMed