BDBM50138721 CHEMBL3753976
SMILES O=C(N(C(=O)c1ccco1)c1nc(nc2cn(nc12)-c1ccccc1)-c1cccs1)c1ccco1
InChI Key InChIKey=PJRZFTAEAPSVMB-UHFFFAOYSA-N
Data  2 KI  1 IC50
  Tab Delimited (TSV)   2D SDfile   Computed 3D by Vconf -m prep SDfile
Find this compound or compounds like it in BindingDB:
Activity Spreadsheet -- Enzyme Inhibition Constant Data from BindingDB
Found 3 hits for monomerid = 50138721
TargetAdenosine receptor A3(Homo sapiens (Human))
Universit£
Curated by ChEMBL
LigandPNGBDBM50138721(CHEMBL3753976)
Affinity DataKi:  1.80nM. Assay description: Displacement of [125I]AB-MECA at human A3A receptor expressed in CHO cell membrane after 60 mins by scintillation counting method
In DepthDetails ArticlePubMed
TargetAdenosine receptor A1(Homo sapiens (Human))
Universit£
Curated by ChEMBL
LigandPNGBDBM50138721(CHEMBL3753976)
Affinity DataKi:  687nM. Assay description: Displacement of [3H]DPCPX at human A1 receptor expressed in CHO cell membrane after 120 mins by scintillation counting method
In DepthDetails ArticlePubMed
TargetAdenosine receptor A3(Homo sapiens (Human))
Universit£
Curated by ChEMBL
LigandPNGBDBM50138721(CHEMBL3753976)
Affinity DataIC50:  4.40nM. Assay description: Antagonist activity at human A3 receptor expressed in CHO cells assessed as inhibition of Cl-IB-MECA-induced cAMP production by scintillation countin...
In DepthDetails ArticlePubMed