BDBM50139424 CHEMBL3763441
SMILES COc1cc(OC)c2c(c1)oc(cc2=O)N1CCN(CC1)c1ccc(cc1)[N+]([O-])=O
InChI Key InChIKey=TWOKPOAQVVUPSY-UHFFFAOYSA-N
Data  2 IC50
  Tab Delimited (TSV)   2D SDfile   Computed 3D by Vconf -m prep SDfile
Find this compound or compounds like it in BindingDB:
Activity Spreadsheet -- Enzyme Inhibition Constant Data from BindingDB
Found 2 hits for monomerid = 50139424
TargetBroad substrate specificity ATP-binding cassette transporter ABCG2(Homo sapiens (Human))
University Of Regensburg
Curated by ChEMBL
LigandPNGBDBM50139424(CHEMBL3763441)
Affinity DataIC50:  1.22E+4nM. Assay description: Inhibition of ABCG2 in human MCF7/Topo cells by Hoechst 33342 assay
In DepthDetails ArticlePubMed
TargetMultidrug resistance-associated protein 1(Homo sapiens (Human))
University Of Regensburg
Curated by ChEMBL
LigandPNGBDBM50139424(CHEMBL3763441)
Affinity DataIC50:  1.21E+4nM. Assay description: Inhibition of human MRP1 transfected in MDCK2 cells assessed as inhibition of calcein-AM efflux
In DepthDetails ArticlePubMed