BDBM50139601 1-(4-bromo-3-(trifluoromethyl)phenyl)-3-(4-(2-(methylcarbamoyl)pyridin-4-yloxy)phenyl)urea::4-(4-(3-(4-bromo-3-(trifluoromethyl)phenyl)ureido)phenoxy)-N-methylpicolinamide::4-{4-[3-(4-Bromo-3-trifluoromethyl-phenyl)-ureido]-phenoxy}-pyridine-2-carboxylic acid methylamide::CHEMBL350747
SMILES CNC(=O)c1cc(Oc2ccc(NC(=O)Nc3ccc(Br)c(c3)C(F)(F)F)cc2)ccn1
InChI Key InChIKey=WINHEDROZCCEOE-UHFFFAOYSA-N
Data  3 IC50
  Tab Delimited (TSV)   2D SDfile   Computed 3D by Vconf -m prep SDfile
Find this compound or compounds like it in BindingDB:
Activity Spreadsheet -- Enzyme Inhibition Constant Data from BindingDB
Found 1 hit for monomerid = 50139601
TargetRAF proto-oncogene serine/threonine-protein kinase(Homo sapiens (Human))
China Pharmaceutical University
Curated by ChEMBL
LigandPNGBDBM50139601(1-(4-bromo-3-(trifluoromethyl)phenyl)-3-(4-(2-(met...)
Affinity DataIC50:  6nM. Assay description: Inhibition of B-Raf1 (unknown origin)
In DepthDetails ArticlePubMed