BDBM50140616 2N-methyl-3-(3-chloro-4-methoxybenzyl)-5-ethyl-4-oxo-(6aR,9aS)-3,4,5,8-tetrahydrocyclopenta[4,5]imidazo[2,1-b]purine-2-carboxamide::CHEMBL26102
SMILES CCN1C2=N[C@@H]3CCC[C@@H]3N2c2nc(C(=O)NC)n(Cc3ccc(OC)c(Cl)c3)c2C1=O
InChI Key InChIKey=VJZHVRSITBOANO-CABCVRRESA-N
Data  2 IC50
  Tab Delimited (TSV)   2D SDfile   Computed 3D by Vconf -m prep SDfile
Find this compound or compounds like it in BindingDB:
Activity Spreadsheet -- Enzyme Inhibition Constant Data from BindingDB
Found 1 hit for monomerid = 50140616
TargetcGMP-specific 3',5'-cyclic phosphodiesterase(Homo sapiens (Human))
Schering-Plough Research Institute
Curated by ChEMBL
LigandPNGBDBM50140616(2N-methyl-3-(3-chloro-4-methoxybenzyl)-5-ethyl-4-o...)
Affinity DataIC50:  2.30nM. Assay description: Inhibitory concentration against human phosphodiesterase 5 (PDE5) enzyme
In DepthDetails ArticlePubMed