BDBM50141043 CHEMBL39132::N-Ethyloxycarbonyl-3-[4-(2-ethyl-5,7-dimethylimidazo-[4,5-b]pyridin-3-ylmethyl)phenyl]-5-isobutylthiophene-2-sulfonamide
SMILES CCOC(=O)NS(=O)(=O)c1sc(CC(C)C)cc1-c1ccc(Cn2c(CC)nc3c(C)cc(C)nc23)cc1
InChI Key InChIKey=ZYBJPUVGTLOXES-UHFFFAOYSA-N
Data  1 KI
  Tab Delimited (TSV)   2D SDfile   Computed 3D by Vconf -m prep SDfile
Find this compound or compounds like it in BindingDB:
Activity Spreadsheet -- Enzyme Inhibition Constant Data from BindingDB
Found 1 hit for monomerid = 50141043
TargetType-2 angiotensin II receptor(Homo sapiens (Human))
Uppsala University
Curated by ChEMBL
LigandPNGBDBM50141043(CHEMBL39132 | N-Ethyloxycarbonyl-3-[4-(2-ethyl-5,7...)
Affinity DataKi: >1.00E+4nM. Assay description: Binding affinity at Angiotensin II receptor, type 2 in pig uterus myometrial membranes by [125I]-Ang II displacement.
In DepthDetails ArticlePubMed