BDBM50141064 3-(4-Phenoxy-phenyl)-1H-pyrazole::CHEMBL41864
SMILES O(c1ccccc1)c1ccc(cc1)-c1cc[nH]n1
InChI Key InChIKey=SGQSMRQYEPPNIA-UHFFFAOYSA-N
Data  1 KI
  Tab Delimited (TSV)   2D SDfile   Computed 3D by Vconf -m prep SDfile
Find this compound or compounds like it in BindingDB:
Activity Spreadsheet -- Enzyme Inhibition Constant Data from BindingDB
Found 1 hit for monomerid = 50141064
TargetSodium channel protein type 4 subunit alpha(Homo sapiens (Human))
Purdue Pharma
Curated by ChEMBL
LigandPNGBDBM50141064(3-(4-Phenoxy-phenyl)-1H-pyrazole | CHEMBL41864)
Affinity DataKi:  240nM. Assay description: Affinity for inactive human SkM1 sodium channel expressed in HEK293 cells
In DepthDetails ArticlePubMed