BDBM50141178 CHEMBL3759521
SMILES ONC(=O)\C=C\c1ccc2OC3(CN(C3)C(=O)c3ccccc3)CC(=O)c2c1
InChI Key InChIKey=NUJVWKGMBBDOHZ-VQHVLOKHSA-N
Data  1 IC50
  Tab Delimited (TSV)   2D SDfile   Computed 3D by Vconf -m prep SDfile
Find this compound or compounds like it in BindingDB:
Activity Spreadsheet -- Enzyme Inhibition Constant Data from BindingDB
Found 1 hit for monomerid = 50141178
TargetHistone deacetylase(Homo sapiens (Human))
European Institute Of Oncology
Curated by ChEMBL
LigandPNGBDBM50141178(CHEMBL3759521)
Affinity DataIC50:  81nM. Assay description: Inhibition of HDAC in human HeLa cells nuclear extract using Fluor de lys as substrate after 15 mins by fluorometric analysis
In DepthDetails ArticlePubMed