BDBM50141241 CHEMBL3758450
SMILES ONC(=O)\C=C\c1ccc2OC3(CCCN(Cc4ccccc4)C3)CC(=O)c2c1
InChI Key InChIKey=GZYLNFIIWXKNGA-CSKARUKUSA-N
Data  3 IC50
  Tab Delimited (TSV)   2D SDfile   Computed 3D by Vconf -m prep SDfile
Find this compound or compounds like it in BindingDB:
Activity Spreadsheet -- Enzyme Inhibition Constant Data from BindingDB
Found 3 hits for monomerid = 50141241
TargetHistone deacetylase(Homo sapiens (Human))
European Institute Of Oncology
Curated by ChEMBL
LigandPNGBDBM50141241(CHEMBL3758450)
Affinity DataIC50:  56nM. Assay description: Inhibition of HDAC in human HeLa cells nuclear extract using Fluor de lys as substrate after 15 mins by fluorometric analysis
In DepthDetails ArticlePubMed
TargetHistone deacetylase(Homo sapiens (Human))
European Institute Of Oncology
Curated by ChEMBL
LigandPNGBDBM50141241(CHEMBL3758450)
Affinity DataIC50:  84nM. Assay description: Inhibition of HDAC in human HeLa cells nuclear extract using Fluor de lys as substrate after 15 mins by fluorometric analysis
In DepthDetails ArticlePubMed
TargetHistone deacetylase(Homo sapiens (Human))
European Institute Of Oncology
Curated by ChEMBL
LigandPNGBDBM50141241(CHEMBL3758450)
Affinity DataIC50:  56nM. Assay description: Inhibition of HDAC in human HeLa cells nuclear extract using Fluor de lys as substrate after 15 mins by fluorometric analysis
In DepthDetails ArticlePubMed