BDBM50142172 2-{4-[(Benzimidoyl-methyl-amino)-methyl]-benzoylamino}-5-chloro-N-(5-chloro-pyridin-2-yl)-benzamide::CHEMBL368126
SMILES CN(Cc1ccc(cc1)C(=O)Nc1ccc(Cl)cc1C(=O)Nc1ccc(Cl)cn1)C(=N)c1ccccc1
InChI Key InChIKey=PBDCKQYPVQLECO-UHFFFAOYSA-N
Data  6 IC50
  Tab Delimited (TSV)   2D SDfile   Computed 3D by Vconf -m prep SDfile
Find this compound or compounds like it in BindingDB:
Activity Spreadsheet -- Enzyme Inhibition Constant Data from BindingDB
Found 6 hits for monomerid = 50142172
TargetCoagulation factor X(Homo sapiens (Human))
Millennium Pharmaceuticals
Curated by ChEMBL
LigandPNGBDBM50142172(2-{4-[(Benzimidoyl-methyl-amino)-methyl]-benzoylam...)
Affinity DataIC50:  11nM. Assay description: In vitro inhibitory activity against coagulation factor X.
In DepthDetails ArticlePubMed
TargetTissue-type plasminogen activator(Homo sapiens (Human))
Millennium Pharmaceuticals
Curated by ChEMBL
LigandPNGBDBM50142172(2-{4-[(Benzimidoyl-methyl-amino)-methyl]-benzoylam...)
Affinity DataIC50: >1.10E+4nM. Assay description: Inhibitory activity against tissue type plasminogen activator.
In DepthDetails ArticlePubMed
TargetPlasminogen(Homo sapiens (Human))
Millennium Pharmaceuticals
Curated by ChEMBL
LigandPNGBDBM50142172(2-{4-[(Benzimidoyl-methyl-amino)-methyl]-benzoylam...)
Affinity DataIC50: >1.10E+4nM. Assay description: Inhibitory activity against plasmin.
In DepthDetails ArticlePubMed
TargetVitamin K-dependent protein C(Homo sapiens (Human))
Millennium Pharmaceuticals
Curated by ChEMBL
LigandPNGBDBM50142172(2-{4-[(Benzimidoyl-methyl-amino)-methyl]-benzoylam...)
Affinity DataIC50: >1.10E+4nM. Assay description: Inhibitory activity against activated protein C
In DepthDetails ArticlePubMed
TargetSerine protease 1(Homo sapiens (Human))
Millennium Pharmaceuticals
Curated by ChEMBL
LigandPNGBDBM50142172(2-{4-[(Benzimidoyl-methyl-amino)-methyl]-benzoylam...)
Affinity DataIC50: >1.10E+4nM. Assay description: Inhibitory activity against trypsin.
In DepthDetails ArticlePubMed
TargetProthrombin(Homo sapiens (Human))
Millennium Pharmaceuticals
Curated by ChEMBL
LigandPNGBDBM50142172(2-{4-[(Benzimidoyl-methyl-amino)-methyl]-benzoylam...)
Affinity DataIC50: >1.10E+4nM. Assay description: Inhibitory activity against thrombin.
In DepthDetails ArticlePubMed