BDBM50142719 CHEMBL49895::Morpholin-4-yl-carbamic acid 4-[(4-tert-butyl-cyclohexanecarbonyl)-amino]-phenyl ester
SMILES CC(C)(C)C1CCC(CC1)C(=O)Nc1ccc(OC(=O)NN2CCOCC2)cc1
InChI Key InChIKey=XSLDWDIQZLTRHG-UHFFFAOYSA-N
Data  1 IC50
  Tab Delimited (TSV)   2D SDfile   Computed 3D by Vconf -m prep SDfile
Find this compound or compounds like it in BindingDB:
Activity Spreadsheet -- Enzyme Inhibition Constant Data from BindingDB
Found 1 hit for monomerid = 50142719
TargetHormone-sensitive lipase(Homo sapiens (Human))
Novo Nordisk
Curated by ChEMBL
LigandPNGBDBM50142719(CHEMBL49895 | Morpholin-4-yl-carbamic acid 4-[(4-t...)
Affinity DataIC50:  1nM. Assay description: Inhibition of human recombinant hormone sensitive lipase.
In DepthDetails ArticlePubMed