BDBM50142806 4-{2-[1'-(2-Amino-3-methyl-benzoyl)-[1,4']bipiperidinyl-4-yl]-[1,3]dioxolan-2-yl}-N-isopropyl-benzamide::CHEMBL422763
SMILES CC(C)NC(=O)c1ccc(cc1)C1(OCCO1)C1CCN(CC1)C1CCN(CC1)C(=O)c1cccc(C)c1N
InChI Key InChIKey=HGQVASDPTOFFDJ-UHFFFAOYSA-N
Data  1 KI
  Tab Delimited (TSV)   2D SDfile   Computed 3D by Vconf -m prep SDfile
Find this compound or compounds like it in BindingDB:
Activity Spreadsheet -- Enzyme Inhibition Constant Data from BindingDB
Found 1 hit for monomerid = 50142806
TargetMuscarinic acetylcholine receptor M2(Homo sapiens (Human))
Schering-Plough Research Institute
Curated by ChEMBL
LigandPNGBDBM50142806(4-{2-[1'-(2-Amino-3-methyl-benzoyl)-[1,4']bipiperi...)
Affinity DataKi:  2.70nM. Assay description: Binding affinity against cloned human muscarinic acetylcholine receptor M2.
In DepthDetails ArticlePubMed