BDBM50142820 4-[1'-(4,5-Difluoro-naphthalene-1-carbonyl)-[1,4']bipiperidinyl-4-ylmethyl]-N-isopropyl-benzamide::CHEMBL51574
SMILES CC(C)NC(=O)c1ccc(CC2CCN(CC2)C2CCN(CC2)C(=O)c2ccc(F)c3c(F)cccc23)cc1
InChI Key InChIKey=HSCJVFKBAKREKK-UHFFFAOYSA-N
Data  1 KI
  Tab Delimited (TSV)   2D SDfile   Computed 3D by Vconf -m prep SDfile
Find this compound or compounds like it in BindingDB:
Activity Spreadsheet -- Enzyme Inhibition Constant Data from BindingDB
Found 1 hit for monomerid = 50142820
TargetMuscarinic acetylcholine receptor M2(Homo sapiens (Human))
Schering-Plough Research Institute
Curated by ChEMBL
LigandPNGBDBM50142820(4-[1'-(4,5-Difluoro-naphthalene-1-carbonyl)-[1,4']...)
Affinity DataKi:  9nM. Assay description: Binding affinity against cloned human muscarinic acetylcholine receptor M2.
In DepthDetails ArticlePubMed