BDBM50142846 (S)-2-[(R)-(6-Bromo-naphthalen-2-yl)-methoxycarbonyl-methyl]-pyrrolidinium; chloride::CHEMBL301830
SMILES COC(=O)[C@@H]([C@@H]1CCC[NH2+]1)c1ccc2cc(Br)ccc2c1
InChI Key InChIKey=CEWOEUHWHFEXBY-JKSUJKDBSA-O
Data  2 KI  2 IC50
  Tab Delimited (TSV)   2D SDfile   Computed 3D by Vconf -m prep SDfile
Find this compound or compounds like it in BindingDB:
Activity Spreadsheet -- Enzyme Inhibition Constant Data from BindingDB
Found 4 hits for monomerid = 50142846
TargetSodium-dependent serotonin transporter(Rattus norvegicus (rat))
State University Of New York
Curated by ChEMBL
LigandPNGBDBM50142846((S)-2-[(R)-(6-Bromo-naphthalen-2-yl)-methoxycarbon...)
Affinity DataKi:  5.5nM. Assay description: Ability to displace 0.4 nM [3H]-paroxetine binding to serotonin transporter in rat frontal cortex
In DepthDetails ArticlePubMed
TargetSodium-dependent serotonin transporter(Rattus norvegicus (rat))
State University Of New York
Curated by ChEMBL
LigandPNGBDBM50142846((S)-2-[(R)-(6-Bromo-naphthalen-2-yl)-methoxycarbon...)
Affinity DataKi:  5.5nM. Assay description: Ability to displace 0.4 nM [3H]-paroxetine binding to serotonin transporter in rat frontal cortex
In DepthDetails ArticlePubMed
TargetSodium-dependent dopamine transporter(Rattus norvegicus (rat))
State University Of New York
Curated by ChEMBL
LigandPNGBDBM50142846((S)-2-[(R)-(6-Bromo-naphthalen-2-yl)-methoxycarbon...)
Affinity DataIC50:  446nM. Assay description: Potency of inhibiting 10 pM [125I]-RTI-55 binding to dopamine transporter in rat striatal membranes
In DepthDetails ArticlePubMed
TargetSodium-dependent dopamine transporter(Rattus norvegicus (rat))
State University Of New York
Curated by ChEMBL
LigandPNGBDBM50142846((S)-2-[(R)-(6-Bromo-naphthalen-2-yl)-methoxycarbon...)
Affinity DataIC50:  446nM. Assay description: Potency of inhibiting 10 pM [125I]-RTI-55 binding to dopamine transporter in rat striatal membranes
In DepthDetails ArticlePubMed