BDBM50142847 (R)-2-((S)-Methoxycarbonyl-naphthalen-2-yl-methyl)-pyrrolidinium; chloride::CHEMBL51264
SMILES COC(=O)[C@H]([C@H]1CCC[NH2+]1)c1ccc2ccccc2c1
InChI Key InChIKey=NHOGTKAKJAXBLQ-CVEARBPZSA-O
Data  1 KI  1 IC50
  Tab Delimited (TSV)   2D SDfile   Computed 3D by Vconf -m prep SDfile
Find this compound or compounds like it in BindingDB:
Activity Spreadsheet -- Enzyme Inhibition Constant Data from BindingDB
Found 2 hits for monomerid = 50142847
TargetSodium-dependent serotonin transporter(Rattus norvegicus (rat))
State University Of New York
Curated by ChEMBL
LigandPNGBDBM50142847((R)-2-((S)-Methoxycarbonyl-naphthalen-2-yl-methyl)...)
Affinity DataKi:  2.02E+3nM. Assay description: Ability to displace 0.4 nM [3H]-paroxetine binding to serotonin transporter in rat frontal cortex
In DepthDetails ArticlePubMed
TargetSodium-dependent dopamine transporter(Rattus norvegicus (rat))
State University Of New York
Curated by ChEMBL
LigandPNGBDBM50142847((R)-2-((S)-Methoxycarbonyl-naphthalen-2-yl-methyl)...)
Affinity DataIC50:  1.75E+3nM. Assay description: Potency of inhibiting 10 pM [125I]-RTI-55 binding to dopamine transporter in rat striatal membranes
In DepthDetails ArticlePubMed