BDBM50143551 CHEMBL3759598
SMILES [H][C@@]12CCc3cc(ccc3[C@@]1(C)CCC[C@@]2(C)C(=O)NC(=S)Nc1cc(Cl)c(NCC(P(=O)(OCC)OCC)P(=O)(OCC)OCC)cc1Cl)C(C)C
InChI Key InChIKey=CQUMWIOBLHOWLT-ZHVXKKCRSA-N
Data  1 IC50
  Tab Delimited (TSV)   2D SDfile   Computed 3D by Vconf -m prep SDfile
Find this compound or compounds like it in BindingDB:
Activity Spreadsheet -- Enzyme Inhibition Constant Data from BindingDB
Found 1 hit for monomerid = 50143551
TargetCyclin-dependent kinase 2/G1/S-specific cyclin-E1(Homo sapiens (Human))
Southeast University
Curated by ChEMBL
LigandPNGBDBM50143551(CHEMBL3759598)
Affinity DataIC50: >5.00E+4nM. Assay description: Inhibition of human recombinant C-terminal His6-tagged full length human Cdk2/human recombinant N-terminal GST-tagged full-length Cyclin E using hist...
In DepthDetails ArticlePubMed