BDBM50144463 CHEMBL71871::N-(3-Dibenzylamino-2-hydroxymethyl-phenyl)-methanesulfonamide
SMILES CS(=O)(=O)Nc1cccc(N(Cc2ccccc2)Cc2ccccc2)c1CO
InChI Key InChIKey=VIZJBWNADGOMCJ-UHFFFAOYSA-N
Data  3 IC50
  Tab Delimited (TSV)   2D SDfile   Computed 3D by Vconf -m prep SDfile
Find this compound or compounds like it in BindingDB:
Activity Spreadsheet -- Enzyme Inhibition Constant Data from BindingDB
Found 3 hits for monomerid = 50144463
TargetGlucocorticoid receptor(Homo sapiens (Human))
Abbott Laboratories
Curated by ChEMBL
LigandPNGBDBM50144463(CHEMBL71871 | N-(3-Dibenzylamino-2-hydroxymethyl-p...)
Affinity DataIC50:  56nM. Assay description: Binding affinity against human Glucocorticoid receptor (GR) using [3H]-dexamethasone as radioligand
In DepthDetails ArticlePubMed
TargetGlucocorticoid receptor(Homo sapiens (Human))
Abbott Laboratories
Curated by ChEMBL
LigandPNGBDBM50144463(CHEMBL71871 | N-(3-Dibenzylamino-2-hydroxymethyl-p...)
Affinity DataIC50:  56nM. Assay description: Inhibition of [3H]-dexamethasone binding to glucocorticoid receptor
In DepthDetails ArticlePubMed
TargetGlucocorticoid receptor(Homo sapiens (Human))
Abbott Laboratories
Curated by ChEMBL
LigandPNGBDBM50144463(CHEMBL71871 | N-(3-Dibenzylamino-2-hydroxymethyl-p...)
Affinity DataIC50:  840nM. Assay description: Inhibition of glucocorticoid receptor dexamethasone response
In DepthDetails ArticlePubMed