BDBM50144466 CHEMBL302250::N-{3-[Benzyl-(2-methyl-benzyl)-amino]-2-methyl-phenyl}-methanesulfonamide
SMILES Cc1ccccc1CN(Cc1ccccc1)c1cccc(NS(C)(=O)=O)c1C
InChI Key InChIKey=AHANXDAYKXJBKN-UHFFFAOYSA-N
Data  2 IC50
  Tab Delimited (TSV)   2D SDfile   Computed 3D by Vconf -m prep SDfile
Find this compound or compounds like it in BindingDB:
Activity Spreadsheet -- Enzyme Inhibition Constant Data from BindingDB
Found 2 hits for monomerid = 50144466
TargetGlucocorticoid receptor(Homo sapiens (Human))
Abbott Laboratories
Curated by ChEMBL
LigandPNGBDBM50144466(CHEMBL302250 | N-{3-[Benzyl-(2-methyl-benzyl)-amin...)
Affinity DataIC50:  810nM. Assay description: Functional activity towards human Glucocorticoid receptor in genetically engineered cell line containing glucocorticoid response element and reporter...
In DepthDetails ArticlePubMed
TargetGlucocorticoid receptor(Homo sapiens (Human))
Abbott Laboratories
Curated by ChEMBL
LigandPNGBDBM50144466(CHEMBL302250 | N-{3-[Benzyl-(2-methyl-benzyl)-amin...)
Affinity DataIC50:  48nM. Assay description: Binding affinity against human Glucocorticoid receptor (GR) using [3H]-dexamethasone as radioligand
In DepthDetails ArticlePubMed