BDBM50144472 CHEMBL70249::N-{3-[Benzyl-(4-methoxy-benzyl)-amino]-2-methyl-phenyl}-methanesulfonamide
SMILES COc1ccc(CN(Cc2ccccc2)c2cccc(NS(C)(=O)=O)c2C)cc1
InChI Key InChIKey=ABFWCZZPERJPEX-UHFFFAOYSA-N
Data  2 IC50
  Tab Delimited (TSV)   2D SDfile   Computed 3D by Vconf -m prep SDfile
Find this compound or compounds like it in BindingDB:
Activity Spreadsheet -- Enzyme Inhibition Constant Data from BindingDB
Found 2 hits for monomerid = 50144472
TargetGlucocorticoid receptor(Homo sapiens (Human))
Abbott Laboratories
Curated by ChEMBL
LigandPNGBDBM50144472(CHEMBL70249 | N-{3-[Benzyl-(4-methoxy-benzyl)-amin...)
Affinity DataIC50:  160nM. Assay description: Binding affinity against human Glucocorticoid receptor (GR) using [3H]-dexamethasone as radioligand
In DepthDetails ArticlePubMed
TargetGlucocorticoid receptor(Homo sapiens (Human))
Abbott Laboratories
Curated by ChEMBL
LigandPNGBDBM50144472(CHEMBL70249 | N-{3-[Benzyl-(4-methoxy-benzyl)-amin...)
Affinity DataIC50:  100nM. Assay description: Binding affinity against human Glucocorticoid receptor (GR) using [3H]-dexamethasone as radioligand
In DepthDetails ArticlePubMed