BDBM50144476 CHEMBL302758::N-{3-[Benzyl-(2-cyano-benzyl)-amino]-2-methyl-phenyl}-methanesulfonamide
SMILES Cc1c(NS(C)(=O)=O)cccc1N(Cc1ccccc1)Cc1ccccc1C#N
InChI Key InChIKey=LTPXRZMBOFQRSK-UHFFFAOYSA-N
Data  1 IC50
  Tab Delimited (TSV)   2D SDfile   Computed 3D by Vconf -m prep SDfile
Find this compound or compounds like it in BindingDB:
Activity Spreadsheet -- Enzyme Inhibition Constant Data from BindingDB
Found 1 hit for monomerid = 50144476
TargetGlucocorticoid receptor(Homo sapiens (Human))
Abbott Laboratories
Curated by ChEMBL
LigandPNGBDBM50144476(CHEMBL302758 | N-{3-[Benzyl-(2-cyano-benzyl)-amino...)
Affinity DataIC50:  60nM. Assay description: Binding affinity against human Glucocorticoid receptor (GR) using [3H]-dexamethasone as radioligand
In DepthDetails ArticlePubMed