BDBM50144485 CHEMBL71968::N-{3-[Benzyl-(2-methoxy-benzyl)-amino]-2-methyl-phenyl}-methanesulfonamide
SMILES COc1ccccc1CN(Cc1ccccc1)c1cccc(NS(C)(=O)=O)c1C
InChI Key InChIKey=OEPAFRCKJPELEP-UHFFFAOYSA-N
Data  1 IC50
  Tab Delimited (TSV)   2D SDfile   Computed 3D by Vconf -m prep SDfile
Find this compound or compounds like it in BindingDB:
Activity Spreadsheet -- Enzyme Inhibition Constant Data from BindingDB
Found 1 hit for monomerid = 50144485
TargetGlucocorticoid receptor(Homo sapiens (Human))
Abbott Laboratories
Curated by ChEMBL
LigandPNGBDBM50144485(CHEMBL71968 | N-{3-[Benzyl-(2-methoxy-benzyl)-amin...)
Affinity DataIC50:  690nM. Assay description: Binding affinity against human Glucocorticoid receptor (GR) using [3H]-dexamethasone as radioligand
In DepthDetails ArticlePubMed