BDBM50144496 CHEMBL72537::N-(2-Acetyl-3-dibenzylamino-phenyl)-methanesulfonamide
SMILES CC(=O)c1c(NS(C)(=O)=O)cccc1N(Cc1ccccc1)Cc1ccccc1
InChI Key InChIKey=MKCBXPWPMVJKNB-UHFFFAOYSA-N
Data  1 IC50
  Tab Delimited (TSV)   2D SDfile   Computed 3D by Vconf -m prep SDfile
Find this compound or compounds like it in BindingDB:
Activity Spreadsheet -- Enzyme Inhibition Constant Data from BindingDB
Found 1 hit for monomerid = 50144496
TargetGlucocorticoid receptor(Homo sapiens (Human))
Abbott Laboratories
Curated by ChEMBL
LigandPNGBDBM50144496(CHEMBL72537 | N-(2-Acetyl-3-dibenzylamino-phenyl)-...)
Affinity DataIC50:  580nM. Assay description: Binding affinity against human Glucocorticoid receptor (GR) using [3H]-dexamethasone as radioligand
In DepthDetails ArticlePubMed