BDBM50144497 CHEMBL71405::N-(6-Dibenzylamino-biphenyl-2-yl)-methanesulfonamide
SMILES CS(=O)(=O)Nc1cccc(N(Cc2ccccc2)Cc2ccccc2)c1-c1ccccc1
InChI Key InChIKey=LCVPELGCRBZVBZ-UHFFFAOYSA-N
Data  1 IC50
  Tab Delimited (TSV)   2D SDfile   Computed 3D by Vconf -m prep SDfile
Find this compound or compounds like it in BindingDB:
Activity Spreadsheet -- Enzyme Inhibition Constant Data from BindingDB
Found 1 hit for monomerid = 50144497
TargetGlucocorticoid receptor(Homo sapiens (Human))
Abbott Laboratories
Curated by ChEMBL
LigandPNGBDBM50144497(CHEMBL71405 | N-(6-Dibenzylamino-biphenyl-2-yl)-me...)
Affinity DataIC50:  450nM. Assay description: Binding affinity against human Glucocorticoid receptor (GR) using [3H]-dexamethasone as radioligand
In DepthDetails ArticlePubMed