BDBM50145180 CHEMBL3763273
SMILES CCCCCC(=C)[C@@H](O)[C@H](C)C(=O)N1[C@@H](Cc2ccccc2)COC1=O
InChI Key InChIKey=JSIYFMCFASVUJH-YTQUADARSA-N
Data  1 IC50
  Tab Delimited (TSV)   2D SDfile   Computed 3D by Vconf -m prep SDfile
Find this compound or compounds like it in BindingDB:
Activity Spreadsheet -- Enzyme Inhibition Constant Data from BindingDB
Found 1 hit for monomerid = 50145180
TargetInterleukin-6 receptor subunit beta(Homo sapiens (Human))
Dongguk University-Seoul
Curated by ChEMBL
LigandPNGBDBM50145180(CHEMBL3763273)
Affinity DataIC50: >2.00E+4nM. Assay description: Inhibition of CDK2/Cyclin E (unknown origin) expressed in baculoviral infected insect Sf9 cells using histone H1 as substrate in presence of [gamma-3...
In DepthDetails ArticlePubMed