BDBM50145924 CHEMBL315066::N*4*-(2-Chloro-6-methyl-phenyl)-N*6*,N*6*-dimethyl-imidazo[1,5-a]quinoxaline-4,6-diamine
SMILES CN(C)c1cccc2c1nc(Nc1c(C)cccc1Cl)c1cncn21
InChI Key InChIKey=GNLCBVRAJXMVTH-UHFFFAOYSA-N
Data  1 IC50
  Tab Delimited (TSV)   2D SDfile   Computed 3D by Vconf -m prep SDfile
Find this compound or compounds like it in BindingDB:
Activity Spreadsheet -- Enzyme Inhibition Constant Data from BindingDB
Found 1 hit for monomerid = 50145924
TargetTyrosine-protein kinase Lck(Homo sapiens (Human))
Yale University
Curated by ChEMBL
LigandPNGBDBM50145924(CHEMBL315066 | N*4*-(2-Chloro-6-methyl-phenyl)-N*6...)
Affinity DataIC50:  5nM. Assay description: Evaluated for inhibition of human p56 Lck tyrosine kinase
In DepthDetails ArticlePubMed