BDBM50146251 CHEMBL432821::Phosphoric acid mono-[3-(4-benzyloxy-phenyl)-2-tetradecanoylamino-propyl] ester
SMILES CCCCCCCCCCCCCC(=O)NC(COP(O)(O)=O)Cc1ccc(OCc2ccccc2)cc1
InChI Key InChIKey=ITYKKJICDXIRIS-UHFFFAOYSA-N
Data  2 IC50
  Tab Delimited (TSV)   2D SDfile   Computed 3D by Vconf -m prep SDfile
Find this compound or compounds like it in BindingDB:
Activity Spreadsheet -- Enzyme Inhibition Constant Data from BindingDB
Found 2 hits for monomerid = 50146251
TargetLysophosphatidic acid receptor 3(Homo sapiens (Human))
University Of Virginia
Curated by ChEMBL
LigandPNGBDBM50146251(CHEMBL432821 | Phosphoric acid mono-[3-(4-benzylox...)
Affinity DataIC50: >1.00E+4nM. Assay description: In vitro antagonism of LPA-evoked [35S]-GTP-gammaS binding to lysophosphatidic acid receptor 3 in HEK293T cell lines
In DepthDetails ArticlePubMed
TargetLysophosphatidic acid receptor 1(Homo sapiens (Human))
University Of Virginia
Curated by ChEMBL
LigandPNGBDBM50146251(CHEMBL432821 | Phosphoric acid mono-[3-(4-benzylox...)
Affinity DataIC50:  9.03E+3nM. Assay description: In vitro ability to antagonize LPA-evoked [35S]-GTP-gammaS binding to lysophosphatidic acid receptor 1 in HEK293T cell lines
In DepthDetails ArticlePubMed