BDBM50147053 5-Methylsulfanyl-4-(5-phenyl-thiazol-2-yl)-thiophene-2-carboxamidine::CHEMBL322672
SMILES CSc1sc(cc1-c1ncc(s1)-c1ccccc1)C(N)=N
InChI Key InChIKey=BBOOVCSXOALWHH-UHFFFAOYSA-N
Data  1 KI
  Tab Delimited (TSV)   2D SDfile   Computed 3D by Vconf -m prep SDfile
Find this compound or compounds like it in BindingDB:
Activity Spreadsheet -- Enzyme Inhibition Constant Data from BindingDB
Found 1 hit for monomerid = 50147053
TargetComplement C1s subcomponent(Homo sapiens (Human))
3-Dimensional Pharmaceuticals
Curated by ChEMBL
LigandPNGBDBM50147053(5-Methylsulfanyl-4-(5-phenyl-thiazol-2-yl)-thiophe...)
Affinity DataKi:  3.25E+3nM. Assay description: In vitro binding affinity towards human Complement C1s subcomponent
In DepthDetails ArticlePubMed