BDBM50147241 4-Isopropyl-3-methyl-5-oxo-5H-isoxazole-2-carboxylic acid furan-2-ylmethyl-methyl-amide::CHEMBL106756::N-(furan-2-ylmethyl)-4-isopropyl-N,3-dimethyl-5-oxoisoxazole-2(5H)-carboxamide
SMILES CC(C)c1c(C)n(oc1=O)C(=O)N(C)Cc1ccco1
InChI Key InChIKey=PJNVXONJCBQJKD-UHFFFAOYSA-N
Data  3 IC50
  Tab Delimited (TSV)   2D SDfile   Computed 3D by Vconf -m prep SDfile
Find this compound or compounds like it in BindingDB:
Activity Spreadsheet -- Enzyme Inhibition Constant Data from BindingDB
Found 3 hits for monomerid = 50147241
TargetHormone-sensitive lipase(Homo sapiens (Human))
Bayer Research Center
Curated by ChEMBL
LigandPNGBDBM50147241(4-Isopropyl-3-methyl-5-oxo-5H-isoxazole-2-carboxyl...)
Affinity DataIC50:  9nM. Assay description: Inhibition of forskolin-stimulated lipolysis in differentiated 3T3-L1 cells
In DepthDetails ArticlePubMed
TargetHormone-sensitive lipase(Homo sapiens (Human))
Bayer Research Center
Curated by ChEMBL
LigandPNGBDBM50147241(4-Isopropyl-3-methyl-5-oxo-5H-isoxazole-2-carboxyl...)
Affinity DataIC50:  4nM. Assay description: Inhibition of forskolin-stimulated lipolysis in differentiated 3T3-L1 cells
In DepthDetails ArticlePubMed
TargetHormone-sensitive lipase(Rattus norvegicus (Rat))
University Of Jordan
Curated by ChEMBL
LigandPNGBDBM50147241(4-Isopropyl-3-methyl-5-oxo-5H-isoxazole-2-carboxyl...)
Affinity DataIC50:  4nM. Assay description: Inhibition of HSL in Wistar rat isolated fat cells by spectrophotometric assay
In DepthDetails ArticlePubMed