BDBM50148053 (1E)-1-(1,1'-biphenyl-3-yl)ethan-1-one thiosemicarbazone::CHEMBL108035
SMILES CC(=NNC(N)=S)c1cccc(c1)-c1ccccc1
InChI Key InChIKey=OEMPMQMUBMCYOI-UHFFFAOYSA-N
Data  2 IC50
  Tab Delimited (TSV)   2D SDfile   Computed 3D by Vconf -m prep SDfile
Find this compound or compounds like it in BindingDB:
Activity Spreadsheet -- Enzyme Inhibition Constant Data from BindingDB
Found 2 hits for monomerid = 50148053
TargetCruzipain(Trypanosoma cruzi)
University Of California San Francisco
Curated by ChEMBL
LigandPNGBDBM50148053((1E)-1-(1,1'-biphenyl-3-yl)ethan-1-one thiosemicar...)
Affinity DataIC50:  8.00E+3nM. Assay description: Inhibition of cruzain from Trypanosoma cruzi
In DepthDetails ArticlePubMed
TargetCysteine protease(Trypanosoma brucei rhodesiense)
University Of California San Francisco
Curated by ChEMBL
LigandPNGBDBM50148053((1E)-1-(1,1'-biphenyl-3-yl)ethan-1-one thiosemicar...)
Affinity DataIC50:  1.10E+3nM. Assay description: Inhibition of rhodesain from Trypanosoma brucei rhodesiense
In DepthDetails ArticlePubMed