BDBM50148054 (1Z)-1-{6-[(1E)-N-(aminocarbonothioyl)ethanehydrazonoyl]pyridin-2-yl}ethan-1-one thiosemicarbazone::CHEMBL325549
SMILES CC(=NNC(N)=S)c1cccc(n1)C(C)=NNC(N)=S
InChI Key InChIKey=AKMAMTPCEONUFQ-UHFFFAOYSA-N
Data  1 IC50
  Tab Delimited (TSV)   2D SDfile   Computed 3D by Vconf -m prep SDfile
Find this compound or compounds like it in BindingDB:
Activity Spreadsheet -- Enzyme Inhibition Constant Data from BindingDB
Found 1 hit for monomerid = 50148054
TargetFalcipain 2(Plasmodium falciparum)
University Of California San Francisco
Curated by ChEMBL
LigandPNGBDBM50148054((1Z)-1-{6-[(1E)-N-(aminocarbonothioyl)ethanehydraz...)
Affinity DataIC50: >2.00E+4nM. Assay description: Inhibition of falcipain2 from Plasmodium falciparum
In DepthDetails ArticlePubMed