BDBM50148130 2-(4-Amino-5H-pyrrolo[3,2-d]pyrimidin-7-yl)-5-(4-fluoro-phenylsulfanylmethyl)-pyrrolidine-3,4-diol; 2hydrochloride::CHEMBL545740
SMILES Nc1ncnc2c(c[nH]c12)C1NC(CSc2ccc(F)cc2)C(O)C1O
InChI Key InChIKey=DMSFZHRHRNCYPG-UHFFFAOYSA-N
Data  2 KI
  Tab Delimited (TSV)   2D SDfile   Computed 3D by Vconf -m prep SDfile
Find this compound or compounds like it in BindingDB:
Activity Spreadsheet -- Enzyme Inhibition Constant Data from BindingDB
Found 2 hits for monomerid = 50148130
TargetS-methyl-5'-thioadenosine phosphorylase(Homo sapiens (Human))
Industrial Research
Curated by ChEMBL
LigandPNGBDBM50148130(2-(4-Amino-5H-pyrrolo[3,2-d]pyrimidin-7-yl)-5-(4-f...)
Affinity DataKi:  2nM. Assay description: Equilibrium dissociation constant towards human 5'-methylthioadenosine phosphorylase
In DepthDetails ArticlePubMed
TargetS-methyl-5'-thioadenosine phosphorylase(Homo sapiens (Human))
Industrial Research
Curated by ChEMBL
LigandPNGBDBM50148130(2-(4-Amino-5H-pyrrolo[3,2-d]pyrimidin-7-yl)-5-(4-f...)
Affinity DataKi:  6.40nM. Assay description: Initial dissociation constant towards human 5'-methylthioadenosine phosphorylase
In DepthDetails ArticlePubMed