BDBM50148142 2-(4-Amino-5H-pyrrolo[3,2-d]pyrimidin-7-yl)-5-propyl-pyrrolidine-3,4-diol; 2hydrochloride::CHEMBL542452
SMILES CCCC1NC(C(O)C1O)c1c[nH]c2c(N)ncnc12
InChI Key InChIKey=KAASNRXINDZWHU-UHFFFAOYSA-N
Data  1 KI
  Tab Delimited (TSV)   2D SDfile   Computed 3D by Vconf -m prep SDfile
Find this compound or compounds like it in BindingDB:
Activity Spreadsheet -- Enzyme Inhibition Constant Data from BindingDB
Found 1 hit for monomerid = 50148142
TargetS-methyl-5'-thioadenosine phosphorylase(Homo sapiens (Human))
Industrial Research
Curated by ChEMBL
LigandPNGBDBM50148142(2-(4-Amino-5H-pyrrolo[3,2-d]pyrimidin-7-yl)-5-prop...)
Affinity DataKi:  44nM. Assay description: Initial dissociation constant towards human 5'-methylthioadenosine phosphorylase
In DepthDetails ArticlePubMed