BDBM50148284 CHEMBL3770449
SMILES CC(=O)c1cc(-c2ccccc2CO)c2cc(ccn12)N1CCOCC1
InChI Key InChIKey=UMHBIHQZTUMFNE-UHFFFAOYSA-N
Data  2 IC50
  Tab Delimited (TSV)   2D SDfile   Computed 3D by Vconf -m prep SDfile
Find this compound or compounds like it in BindingDB:
Activity Spreadsheet -- Enzyme Inhibition Constant Data from BindingDB
Found 2 hits for monomerid = 50148284
TargetBromodomain adjacent to zinc finger domain protein 2B(Homo sapiens (Human))
Glaxosmithkline
Curated by ChEMBL
LigandPNGBDBM50148284(CHEMBL3770449)
Affinity DataIC50:  540nM. Assay description: Inhibition of recombinant His6-TEV fused human BAZ2B expressed in Escherichia coli incubated for 30 mins in presence of biotinylated peptide by alpha...
In DepthDetails ArticlePubMed
TargetBromodomain adjacent to zinc finger domain protein 2A(Homo sapiens (Human))
Glaxosmithkline
Curated by ChEMBL
LigandPNGBDBM50148284(CHEMBL3770449)
Affinity DataIC50:  1.70E+3nM. Assay description: Inhibition of recombinant His6-TEV fused human BAZ2A expressed in Escherichia coli incubated for 30 mins in presence of biotinylated peptide by alpha...
In DepthDetails ArticlePubMed