BDBM50148610 CHEMBL3770917
SMILES ONC(=O)c1csc(n1)-c1ccccc1
InChI Key InChIKey=LPFLSWGOOBVKBD-UHFFFAOYSA-N
Data  3 IC50
  Tab Delimited (TSV)   2D SDfile   Computed 3D by Vconf -m prep SDfile
Find this compound or compounds like it in BindingDB:
Activity Spreadsheet -- Enzyme Inhibition Constant Data from BindingDB
Found 3 hits for monomerid = 50148610
TargetHistone deacetylase 1(Homo sapiens (Human))
Albert-Ludwigs-University Of Freiburg
Curated by ChEMBL
LigandPNGBDBM50148610(CHEMBL3770917)
Affinity DataIC50:  1.03E+4nM. Assay description: Inhibition of human HDAC1 using (Z-(Ac)Lys-AMC) as substrate after 90 mins by fluorescence analysis
In DepthDetails ArticlePubMed
TargetHistone deacetylase 8(Homo sapiens (Human))
Albert-Ludwigs-University Of Freiburg
Curated by ChEMBL
LigandPNGBDBM50148610(CHEMBL3770917)
Affinity DataIC50:  1.21E+4nM. Assay description: Inhibition of human HDAC8 using Z-L-Lys(eta-trifluoroacetyl)-AMC as substrate after 90 mins by fluorescence analysis
In DepthDetails ArticlePubMed
TargetHistone deacetylase 6(Homo sapiens (Human))
Albert-Ludwigs-University Of Freiburg
Curated by ChEMBL
LigandPNGBDBM50148610(CHEMBL3770917)
Affinity DataIC50:  1.91E+3nM. Assay description: Inhibition of human HDAC6 using (Z-(Ac)Lys-AMC) as substrate after 90 mins by fluorescence analysis
In DepthDetails ArticlePubMed