BDBM50148638 CHEMBL3769623::US9518026, Example 46::US9956214, Compound 1605
SMILES CCOc1ccc2cc(cnc2c1)-c1nn(C2CCCC2)c(N)c1C(N)=O
InChI Key InChIKey=KKVWPXTXOCRUQG-UHFFFAOYSA-N
Data  8 IC50
  Tab Delimited (TSV)   2D SDfile   Computed 3D by Vconf -m prep SDfile
Find this compound or compounds like it in BindingDB:
Activity Spreadsheet -- Enzyme Inhibition Constant Data from BindingDB
Found 8 hits for monomerid = 50148638
TargetCalmodulin-domain protein kinase 1(Toxoplasma gondii)
University Of Washington
Curated by ChEMBL
LigandPNGBDBM50148638(CHEMBL3769623 | US9518026, Example 46 | US9956214,...)
Affinity DataIC50:  11nM. Assay description: Inhibition of Toxoplasma gondii CDPK1 assessed as ATP consumption using (Biotin-C6-PLARTLSVAGLPGKK) as substrate after 90 mins by luciferase reporter...
In DepthDetails ArticlePubMed
TargetProto-oncogene tyrosine-protein kinase Src(Homo sapiens (Human))
University Of Washington
Curated by ChEMBL
LigandPNGBDBM50148638(CHEMBL3769623 | US9518026, Example 46 | US9956214,...)
Affinity DataIC50: >1.00E+4nM. Assay description: Inhibition of human SRC using Ac-EIYGEFKKK as substrate after 90 mins by luciferase reporter assay
In DepthDetails ArticlePubMed
TargetCalmodulin-domain protein kinase 1(Toxoplasma gondii)
University Of Washington
Curated by ChEMBL
LigandPNGBDBM50148638(CHEMBL3769623 | US9518026, Example 46 | US9956214,...)
Affinity DataIC50:  11nM. Assay description: Inhibition of recombinant Toxoplasma gondii CDPK1 using Syntide 2 as substrate assessed as decrease in depletion of ATP after 90 mins by Kinase glo l...
In DepthDetails ArticlePubMed
TargetCalcium-dependent protein kinase 1(Cryptosporidium parvum)
University of Washington Through Its Center For Commercialization
US Patent
LigandPNGBDBM50148638(CHEMBL3769623 | US9518026, Example 46 | US9956214,...)
Affinity DataIC50:  4nM. Assay description: Inhibition of TgCDPK1 and CpCDPK1 was determined using a luminescent kinase assay which measures ATP depletion in the presence of the Syntide 2 pepti...
In DepthDetails US Patent
TargetCalmodulin-domain protein kinase 1(Toxoplasma gondii)
University Of Washington
Curated by ChEMBL
LigandPNGBDBM50148638(CHEMBL3769623 | US9518026, Example 46 | US9956214,...)
Affinity DataIC50:  12nM. Assay description: Inhibition of TgCDPK1 and CpCDPK1 was determined using a luminescent kinase assay which measures ATP depletion in the presence of the Syntide 2 pepti...
In DepthDetails US Patent
TargetUncharacterized protein(Cryptosporidium parvum)
University of Washington Through Its Center For Commercialization
US Patent
LigandPNGBDBM50148638(CHEMBL3769623 | US9518026, Example 46 | US9956214,...)
Affinity DataIC50:  3nM. Assay description: Inhibition of TgCDPK1 and CpCDPK1 was determined using a luminescent kinase assay which measures ATP depletion in the presence of the Syntide 2 pepti...
In DepthDetails US Patent
TargetCalmodulin-domain protein kinase 1(Toxoplasma gondii)
University Of Washington
Curated by ChEMBL
LigandPNGBDBM50148638(CHEMBL3769623 | US9518026, Example 46 | US9956214,...)
Affinity DataIC50:  11nM. Assay description: Inhibition of TgCDPK1 and CpCDPK1 was determined using a luminescent kinase assay which measures ATP depletion in the presence of the Syntide 2 pepti...
In DepthDetails US Patent
TargetProto-oncogene tyrosine-protein kinase Src(Homo sapiens (Human))
University Of Washington
Curated by ChEMBL
LigandPNGBDBM50148638(CHEMBL3769623 | US9518026, Example 46 | US9956214,...)
Affinity DataIC50: >1.00E+4nM. Assay description: Inhibition of human SRC using Ac-EIYGEFKKK as substrate after 90 mins by Kinase glo luciferase assay
In DepthDetails ArticlePubMed