BDBM50149468 CHEMBL263746::Sodium; (R)-6-[1-(5,6-dihydro-8H-imidazo[2,1-c][1,4]oxazin-3-yl)-meth-(Z)-ylidene]-7-oxo-4-thia-1-aza-bicyclo[3.2.0]hept-2-ene-2-carboxylate
SMILES [O-]C(=O)C1=CS[C@H]2N1C(=O)\C2=C\c1cnc2COCCn12
InChI Key InChIKey=MTRYCRPKNWRHLE-CPWLGJMPSA-M
Data  4 IC50
  Tab Delimited (TSV)   2D SDfile   Computed 3D by Vconf -m prep SDfile
Find this compound or compounds like it in BindingDB:
Activity Spreadsheet -- Enzyme Inhibition Constant Data from BindingDB
Found 4 hits for monomerid = 50149468
TargetBeta-lactamase(Escherichia coli)
Wyeth Research
Curated by ChEMBL
LigandPNGBDBM50149468(CHEMBL263746 | Sodium; (R)-6-[1-(5,6-dihydro-8H-im...)
Affinity DataIC50:  5nM. Assay description: In vitro inhibitory activity against Class C (Amp-C) beta-Lactamases
In DepthDetails ArticlePubMed
TargetMetallo-beta-lactamase type 2(Bacteroides fragilis)
Wyeth Research
Curated by ChEMBL
LigandPNGBDBM50149468(CHEMBL263746 | Sodium; (R)-6-[1-(5,6-dihydro-8H-im...)
Affinity DataIC50:  66nM. Assay description: In vitro inhibitory activity against Class B (CCRA) beta-Lactamases
In DepthDetails ArticlePubMed
TargetBeta-lactamase(Enterobacter cloacae)
Wyeth Research
Curated by ChEMBL
LigandPNGBDBM50149468(CHEMBL263746 | Sodium; (R)-6-[1-(5,6-dihydro-8H-im...)
Affinity DataIC50:  8nM. Assay description: In vitro inhibitory activity against Class A (Imi-1) beta-Lactamases
In DepthDetails ArticlePubMed
TargetBeta-lactamase TEM(Escherichia coli)
Wyeth Research
Curated by ChEMBL
LigandPNGBDBM50149468(CHEMBL263746 | Sodium; (R)-6-[1-(5,6-dihydro-8H-im...)
Affinity DataIC50:  0.400nM. Assay description: In vitro inhibitory activity against Class A (TEM-1) beta-Lactamases
In DepthDetails ArticlePubMed