BDBM50149838 2''-Amino-6''-(2-hydroxy-6-pentyloxy-phenyl)-1,2,3,4,5,6-hexahydro-[3,4'']bipyridinyl-3''-carbonitrile::CHEMBL182749
SMILES CCCCCOc1cccc(O)c1-c1cc(C2CCCNC2)c(C#N)c(N)n1
InChI Key InChIKey=SSSLRTDQKYZAHB-UHFFFAOYSA-N
Data  3 IC50
  Tab Delimited (TSV)   2D SDfile   Computed 3D by Vconf -m prep SDfile
Find this compound or compounds like it in BindingDB:
Activity Spreadsheet -- Enzyme Inhibition Constant Data from BindingDB
Found 3 hits for monomerid = 50149838
TargetInhibitor of nuclear factor kappa-B kinase subunit beta(Homo sapiens (Human))
Kyoto 619-0216
Curated by ChEMBL
LigandPNGBDBM50149838(2''-Amino-6''-(2-hydroxy-6-pentyloxy-phenyl)-1,2,3...)
Affinity DataIC50:  6nM. Assay description: Inhibition of recombinant human I-kappa-B-kinase beta (IKK beta)
In DepthDetails ArticlePubMed
TargetInhibitor of nuclear factor kappa-B kinase subunit beta(Homo sapiens (Human))
Kyoto 619-0216
Curated by ChEMBL
LigandPNGBDBM50149838(2''-Amino-6''-(2-hydroxy-6-pentyloxy-phenyl)-1,2,3...)
Affinity DataIC50:  6nM. Assay description: Inhibition of human IKKbeta using GST-IkappaBalpha as substrate
In DepthDetails ArticlePubMed
TargetInhibitor of nuclear factor kappa-B kinase subunit beta(Homo sapiens (Human))
Kyoto 619-0216
Curated by ChEMBL
LigandPNGBDBM50149838(2''-Amino-6''-(2-hydroxy-6-pentyloxy-phenyl)-1,2,3...)
Affinity DataIC50:  6nM. Assay description: Inhibition of human IKKbeta using TMB as substrate after 30 mins by spectrophotometry
In DepthDetails ArticlePubMed