BDBM50150777 2,4-Dibromo-6-(2,4-dibromo-6-methoxy-phenoxy)-phenol::2,4-dibromo-6-(2,4-dibromo-6-methoxyphenoxy)phenol::4,6-Dibromo-2-(2'-methoxy-4',6'-dibromophenoxy)phenol::CHEMBL186099
SMILES COc1cc(Br)cc(Br)c1Oc1cc(Br)cc(Br)c1O
InChI Key InChIKey=ZMXOEWVGOVDWHT-UHFFFAOYSA-N
Data  2 IC50
  Tab Delimited (TSV)   2D SDfile   Computed 3D by Vconf -m prep SDfile
Find this compound or compounds like it in BindingDB:
Activity Spreadsheet -- Enzyme Inhibition Constant Data from BindingDB
Found 2 hits for monomerid = 50150777
TargetPolyunsaturated fatty acid lipoxygenase ALOX12(Homo sapiens (Human))
University Of California
Curated by ChEMBL
LigandPNGBDBM50150777(2,4-Dibromo-6-(2,4-dibromo-6-methoxy-phenoxy)-phen...)
Affinity DataIC50:  1.20E+4nM. Assay description: Inhibitory effect on human platelet 12-lipoxygenase
In DepthDetails ArticlePubMed
TargetPolyunsaturated fatty acid lipoxygenase ALOX15(Homo sapiens (Human))
University Of California
Curated by ChEMBL
LigandPNGBDBM50150777(2,4-Dibromo-6-(2,4-dibromo-6-methoxy-phenoxy)-phen...)
Affinity DataIC50:  1.00E+4nM. Assay description: Inhibitory effect on human reticulocyte 15-lipoxygenase
In DepthDetails ArticlePubMed