BDBM50150941 CHEMBL2181969::MRS-1292
SMILES O[C@@H]1[C@H](O)C2(CCNC2=O)O[C@H]1n1cnc2c(NCc3cccc(I)c3)ncnc12
InChI Key InChIKey=GFHAZFGYXHKHAK-AGLNEJJOSA-N
Data  1 KI
  Tab Delimited (TSV)   2D SDfile   Computed 3D by Vconf -m prep SDfile
Find this compound or compounds like it in BindingDB:
Activity Spreadsheet -- Enzyme Inhibition Constant Data from BindingDB
Found 1 hit for monomerid = 50150941
TargetAdenosine receptor A3(Homo sapiens (Human))
University Of Minnesota
Curated by ChEMBL
LigandPNGBDBM50150941(CHEMBL2181969 | MRS-1292)
Affinity DataKi:  29nM. Assay description: Inhibitory activity against Beta-glucosidase from Almond
In DepthDetails ArticlePubMed