BDBM50150949 21,30-Diethyl-33-(1-hydroxy-2-methyl-hex-4-enyl)-6,9,18,24-tetraisobutyl-3-isopropyl-1,4,7,10,12,15,19,25,28-nonamethyl-1,4,7,10,13,16,19,22,25,28,31undecaaza-cyclotritriacontan-2,5,8,11,14,17,20,23,26,29,32-undecaone::CHEMBL407456
SMILES CC[C@@H]1NC(=O)[C@H](C(O)[C@H](C)C\C=C\C)N(C)C(=O)[C@H](C(C)C)N(C)C(=O)[C@H](CC(C)C)N(C)C(=O)[C@@H](CC(C)C)N(C)C(=O)[C@@H](C)NC(=O)[C@H](C)NC(=O)[C@H](CC(C)C)N(C)C(=O)[C@@H](CC)NC(=O)[C@@H](CC(C)C)N(C)C(=O)CN(C)C1=O
InChI Key InChIKey=IPDSMZFDGQKXHO-PIPXXAPASA-N
Data  1 KI
  Tab Delimited (TSV)   2D SDfile   Computed 3D by Vconf -m prep SDfile
Find this compound or compounds like it in BindingDB:
Activity Spreadsheet -- Enzyme Inhibition Constant Data from BindingDB
Found 1 hit for monomerid = 50150949
TargetPeptidyl-prolyl cis-trans isomerase A(Homo sapiens (Human))
Guilford Pharmaceuticals
Curated by ChEMBL
LigandPNGBDBM50150949(21,30-Diethyl-33-(1-hydroxy-2-methyl-hex-4-enyl)-6...)
Affinity DataKi:  24nM. Assay description: Inhibition of cyclophilin A rotamase
In DepthDetails ArticlePubMed