BDBM50153038 5-Ethyl-3,4-diphenyl-isoxazole::CHEMBL361504
SMILES CCc1onc(c1-c1ccccc1)-c1ccccc1
InChI Key InChIKey=MXTWADCRLRQMDW-UHFFFAOYSA-N
Data  4 IC50
  Tab Delimited (TSV)   2D SDfile   Computed 3D by Vconf -m prep SDfile
Find this compound or compounds like it in BindingDB:
Activity Spreadsheet -- Enzyme Inhibition Constant Data from BindingDB
Found 4 hits for monomerid = 50153038
TargetProstaglandin G/H synthase 1(Homo sapiens (Human))
Università
Curated by ChEMBL
LigandPNGBDBM50153038(5-Ethyl-3,4-diphenyl-isoxazole | CHEMBL361504)
Affinity DataIC50:  50nM. Assay description: In vitro inhibitory concentration against Prostaglandin G/H synthase 1 in human whole blood assay
In DepthDetails ArticlePubMed
TargetProstaglandin G/H synthase 2(Homo sapiens (Human))
University Of Bari "A. Moro
Curated by ChEMBL
LigandPNGBDBM50153038(5-Ethyl-3,4-diphenyl-isoxazole | CHEMBL361504)
Affinity DataIC50:  1.49E+3nM. Assay description: Inhibition of human monocyte COX2 by whole blood assay
In DepthDetails ArticlePubMed
TargetProstaglandin G/H synthase 1(Homo sapiens (Human))
Università
Curated by ChEMBL
LigandPNGBDBM50153038(5-Ethyl-3,4-diphenyl-isoxazole | CHEMBL361504)
Affinity DataIC50:  50nM. Assay description: Inhibition of human platelet COX1 by whole blood assay
In DepthDetails ArticlePubMed
TargetProstaglandin G/H synthase 2(Homo sapiens (Human))
University Of Bari "A. Moro
Curated by ChEMBL
LigandPNGBDBM50153038(5-Ethyl-3,4-diphenyl-isoxazole | CHEMBL361504)
Affinity DataIC50:  1.49E+3nM. Assay description: In vitro inhibitory concentration against Prostaglandin G/H synthase 2 in human whole blood assay
In DepthDetails ArticlePubMed