BDBM50153383 (S)-1-(3-Amino-4-phenyl-butyryl)-pyrrolidine-2-carboxylic acid 5-chloro-2-cyclopropylcarbamoylmethoxy-benzylamide::CHEMBL186649
SMILES NC(CC(=O)N1CCC[C@H]1C(=O)NCc1cc(Cl)ccc1OCC(=O)NC1CC1)Cc1ccccc1
InChI Key InChIKey=FEFCYNYYEURJOF-YANBTOMASA-N
Data  1 IC50
  Tab Delimited (TSV)   2D SDfile   Computed 3D by Vconf -m prep SDfile
Find this compound or compounds like it in BindingDB:
Activity Spreadsheet -- Enzyme Inhibition Constant Data from BindingDB
Found 1 hit for monomerid = 50153383
TargetDipeptidyl peptidase 4(Homo sapiens (Human))
Merck
Curated by ChEMBL
LigandPNGBDBM50153383((S)-1-(3-Amino-4-phenyl-butyryl)-pyrrolidine-2-car...)
Affinity DataIC50:  1.90E+3nM. Assay description: Inhibition of human recombinant Dipeptidylpeptidase IV
In DepthDetails ArticlePubMed